Estoy tratando de ejecutar un comando ./gradlew app:assembleAndroidTestdentro androiddel directorio de mi aplicación para crear un directorio app-debug-androidTest.apkinferior .androidTest

Pero mi compilación falla con los siguientes errores:

> Task :app:compileDevDebugAndroidTestJavaWithJavac
C:\Users\Noyruto\sources\repos\limitless-app\android\app\src\androidTest\java\ph\phoenixfuels\limitless\MainActivityTest.java:11: error: cannot find symbol
  public ActivityTestRule<MainActivity> rule = new ActivityTestRule<>(MainActivity.class, true, false);
                          ^
  symbol:   class MainActivity
  location: class MainActivityTest
C:\Users\Noyruto\sources\repos\limitless-app\android\app\src\androidTest\java\ph\phoenixfuels\limitless\MainActivityTest.java:11: error: cannot find symbol
  public ActivityTestRule<MainActivity> rule = new ActivityTestRule<>(MainActivity.class, true, false);
                                                                      ^
  symbol:   class MainActivity
  location: class MainActivityTest
2 errors

> Task :app:compileDevDebugAndroidTestJavaWithJavac FAILED

FAILURE: Build failed with an exception.

* What went wrong:
Execution failed for task ':app:compileDevDebugAndroidTestJavaWithJavac'.

No creo que haya ningún problema con mi MainActivityTest.java porque probé esto en otra aplicación de flutter y se compiló correctamente. ¿Es porque mi proyecto tiene un sabor?

no se encontró respuesta